[SURBL-Discuss] Make test error with Mail-SpamAssassin-SpamCopURI-0.12

Eric Kolve ekolve at comcast.net
Thu Apr 22 14:24:02 CEST 2004




Okay, this seems to be a perl 5.005 thing.  I will
add a fix and upload a new release later tonight.

--eric

On Thu, Apr 22, 2004 at 12:20:33PM -0700, RW Hawkins wrote:
> URI looks up to date:
> 
> # perl -MURI -e 'print $URI::VERSION,"\n"';
> 1.30
> 
> I upgraded Net::DNS and got a little farther, but similar errors.
> 
> [root at mail-in Mail-SpamAssassin-SpamCopURI-0.12]# perl Makefile.PL
> Checking if your kit is complete...
> Looks good
> Writing Makefile for Mail::SpamAssassin::SpamCopURI
> [root at mail-in Mail-SpamAssassin-SpamCopURI-0.12]# make
> mkdir blib
> mkdir blib/lib
> mkdir blib/lib/Mail
> mkdir blib/lib/Mail/SpamAssassin
> mkdir blib/arch
> mkdir blib/arch/auto
> mkdir blib/arch/auto/Mail
> mkdir blib/arch/auto/Mail/SpamAssassin
> mkdir blib/arch/auto/Mail/SpamAssassin/SpamCopURI
> mkdir blib/lib/auto
> mkdir blib/lib/auto/Mail
> mkdir blib/lib/auto/Mail/SpamAssassin
> mkdir blib/lib/auto/Mail/SpamAssassin/SpamCopURI
> mkdir blib/man3
> cp lib/Mail/SpamAssassin/PerMsgStatus.pm 
> blib/lib/Mail/SpamAssassin/PerMsgStatus.pm
> cp lib/Mail/SpamAssassin/SpamCopURI.pm 
> blib/lib/Mail/SpamAssassin/SpamCopURI.pm
> cp lib/Mail/SpamAssassin/Conf.pm blib/lib/Mail/SpamAssassin/Conf.pm
> Manifying blib/man3/Mail::SpamAssassin::PerMsgStatus.3
> Manifying blib/man3/Mail::SpamAssassin::SpamCopURI.3
> Manifying blib/man3/Mail::SpamAssassin::Conf.3
> [root at mail-in Mail-SpamAssassin-SpamCopURI-0.12]# make test
> PERL_DL_NONLAZY=1 /usr/local/bin/perl -Iblib/arch -Iblib/lib 
> -I/usr/lib/perl5/5.00503/i386-linux -I/usr/lib/perl5/5.00503 -e 'use 
> Test::Harness qw(&runtests $verbose); $verbose=0; runtests @ARGV;' t/*.t
> t/blacklist........syntax error at 
> blib/lib/Mail/SpamAssassin/SpamCopURI.pm line 107, near "$f :"
> BEGIN failed--compilation aborted at t/blacklist.t line 4.
> # Looks like your test died before it could output anything.
> t/blacklist........dubious
>        Test returned status 255 (wstat 65280, 0xff00)
> DIED. FAILED tests 1-4
>        Failed 4/4 tests, 0.00% okay
> t/dnsrbl...........syntax error at 
> blib/lib/Mail/SpamAssassin/SpamCopURI.pm line 107, near "$f :"
> BEGIN failed--compilation aborted at t/dnsrbl.t line 6.
> # Looks like your test died before it could output anything.
> t/dnsrbl...........dubious
>        Test returned status 255 (wstat 65280, 0xff00)
> DIED. FAILED tests 1-6
>        Failed 6/6 tests, 0.00% okay
> t/mailto...........syntax error at 
> blib/lib/Mail/SpamAssassin/SpamCopURI.pm line 107, near "$f :"
> BEGIN failed--compilation aborted at t/mailto.t line 4.
> # Looks like your test died before it could output anything.
> t/mailto...........dubious
>        Test returned status 255 (wstat 65280, 0xff00)
> DIED. FAILED test 1
>        Failed 1/1 tests, 0.00% okay
> t/open_redirect....syntax error at 
> blib/lib/Mail/SpamAssassin/SpamCopURI.pm line 107, near "$f :"
> BEGIN failed--compilation aborted at t/open_redirect.t line 6.
> # Looks like your test died before it could output anything.
> t/open_redirect....dubious
>        Test returned status 255 (wstat 65280, 0xff00)
> DIED. FAILED tests 1-7
>        Failed 7/7 tests, 0.00% okay
> t/spamcopuri.......syntax error at 
> blib/lib/Mail/SpamAssassin/SpamCopURI.pm line 107, near "$f :"
> BEGIN failed--compilation aborted at t/spamcopuri.t line 4.
> # Looks like your test died before it could output anything.
> t/spamcopuri.......dubious
>        Test returned status 255 (wstat 65280, 0xff00)
> DIED. FAILED tests 1-4
>        Failed 4/4 tests, 0.00% okay
> t/whitelist........syntax error at 
> blib/lib/Mail/SpamAssassin/SpamCopURI.pm line 107, near "$f :"
> BEGIN failed--compilation aborted at t/whitelist.t line 6.
> # Looks like your test died before it could output anything.
> t/whitelist........dubious
>        Test returned status 255 (wstat 65280, 0xff00)
> DIED. FAILED tests 1-6
>        Failed 6/6 tests, 0.00% okay
> Failed Test       Stat Wstat Total Fail  Failed  List of Failed
> -------------------------------------------------------------------------------
> t/blacklist.t      255 65280     4    8 200.00%  1-4
> t/dnsrbl.t         255 65280     6   12 200.00%  1-6
> t/mailto.t         255 65280     1    2 200.00%  1
> t/open_redirect.t  255 65280     7   14 200.00%  1-7
> t/spamcopuri.t     255 65280     4    8 200.00%  1-4
> t/whitelist.t      255 65280     6   12 200.00%  1-6
> Failed 6/6 test scripts, 0.00% okay. 28/28 subtests failed, 0.00% okay.
> make: *** [test_dynamic] Error 11
> 
> 
> Eric Kolve said the following on 04/22/2004 11:38 AM:
> 
> >Can you run: 
> >
> >perl -MURI -e 'print $URI::VERSION,"\n"';
> >
> >
> >I think you may have an older version of URI.
> >
> >If this is the case, I will add 1.30 to the PRE_REQPM.
> >
> >--eric
> >
> >On Thu, Apr 22, 2004 at 11:12:26AM -0700, RW Hawkins wrote:
> > 
> >
> >>I am trying to get the SpamCopURI working with our Spamassassin setup. I 
> >>think this approach to spam smashing is very promising, great work! The 
> >>error I get is as follows:
> >>
> >>[root at mail-in Mail-SpamAssassin-SpamCopURI-0.12]# perl Makefile.PL
> >>Checking if your kit is complete...
> >>Looks good
> >>Writing Makefile for Mail::SpamAssassin::SpamCopURI
> >>[root at mail-in Mail-SpamAssassin-SpamCopURI-0.12]# make
> >>mkdir blib
> >>mkdir blib/lib
> >>mkdir blib/lib/Mail
> >>mkdir blib/lib/Mail/SpamAssassin
> >>mkdir blib/arch
> >>mkdir blib/arch/auto
> >>mkdir blib/arch/auto/Mail
> >>mkdir blib/arch/auto/Mail/SpamAssassin
> >>mkdir blib/arch/auto/Mail/SpamAssassin/SpamCopURI
> >>mkdir blib/lib/auto
> >>mkdir blib/lib/auto/Mail
> >>mkdir blib/lib/auto/Mail/SpamAssassin
> >>mkdir blib/lib/auto/Mail/SpamAssassin/SpamCopURI
> >>mkdir blib/man3
> >>cp lib/Mail/SpamAssassin/PerMsgStatus.pm 
> >>blib/lib/Mail/SpamAssassin/PerMsgStatus.pm
> >>cp lib/Mail/SpamAssassin/SpamCopURI.pm 
> >>blib/lib/Mail/SpamAssassin/SpamCopURI.pm
> >>cp lib/Mail/SpamAssassin/Conf.pm blib/lib/Mail/SpamAssassin/Conf.pm
> >>Manifying blib/man3/Mail::SpamAssassin::PerMsgStatus.3
> >>Manifying blib/man3/Mail::SpamAssassin::SpamCopURI.3
> >>Manifying blib/man3/Mail::SpamAssassin::Conf.3
> >>[root at mail-in Mail-SpamAssassin-SpamCopURI-0.12]# make test
> >>PERL_DL_NONLAZY=1 /usr/local/bin/perl -Iblib/arch -Iblib/lib 
> >>-I/usr/lib/perl5/5.00503/i386-linux -I/usr/lib/perl5/5.00503 -e 'use 
> >>Test::Harness qw(&runtests $verbose); $verbose=0; runtests @ARGV;' t/*.t
> >>t/blacklist.........syntax error at 
> >>blib/lib/Mail/SpamAssassin/SpamCopURI.pm line 107, near "$f :"
> >>BEGIN failed--compilation aborted at t/blacklist.t line 4.
> >># No tests run!
> >>dubious
> >>      Test returned status 255 (wstat 65280, 0xff00)
> >>Undefined subroutine &Test::Harness::WCOREDUMP called at 
> >>/usr/lib/perl5/5.00503/Test/Harness.pm line 288.
> >>make: *** [test_dynamic] Error 255
> >>
> >>From past user errors I am guessing I have something out of date, but 
> >>not sure exactly what.
> >>
> >>Thanks in advance,
> >>RW
> >>
> >>
> >>_______________________________________________
> >>Discuss mailing list
> >>Discuss at lists.surbl.org
> >>http://lists.surbl.org/mailman/listinfo/discuss
> >>   
> >>
> >_______________________________________________
> >Discuss mailing list
> >Discuss at lists.surbl.org
> >http://lists.surbl.org/mailman/listinfo/discuss
> > 
> >
> 
> 
> _______________________________________________
> Discuss mailing list
> Discuss at lists.surbl.org
> http://lists.surbl.org/mailman/listinfo/discuss


More information about the Discuss mailing list